﻿childid_key,Visit,BaselineDate,District,Block,Panchayat,Village,Child_Name,DoB,Mother_Name,Mother_Mobile_Number,OPV0,HepB,BCG,OPV1,Penta1,Rota1,PCV1,IPV1,OPV2,Penta2,Rota2,OPV3,Penta3,Rota3,PCV2,IPV2,MR1,PCVBooster,DPTBooster1,MR2,OPVBooster
c2,Baseline,2021-09-22,Simdega,T.Tanger,T. Tangar,Rajabasa,Ankita bhengra,2019-04-09,Priynaka bhengra, ,2019-04-09,,2019-05-07,2019-06-20,2019-06-20,2019-06-20,,2019-06-20,2019-07-21,2019-07-18,2019-07-18,2019-08-20,2019-08-17,2019-08-17,,2019-08-17,2020-01-16,,2020-08-20,2020-08-20,2020-09-22
c3,Baseline,2021-09-22,Simdega,T.Tanger,Konpala,Konpala,Anit kerketa,2019-02-09,Sangeeta Kerketa,9771021067,,,2019-03-25,2019-03-23,2019-04-25,2019-04-25,,,2019-04-23,2019-05-23,2019-05-25,,2019-06-27,,,,2019-11-16,,,,
c4,Baseline,2021-09-22,Simdega,T.Tanger,Tukupani,Tukupani,Abinit dungdung,2020-09-01,Rekha dungdung, ,2020-09-05,,2020-09-05,2020-10-22,2020-10-22,2020-10-22,,2020-10-22,2020-11-26,2020-11-26,2020-11-26,2020-12-26,2021-01-11,2020-12-21,,2020-12-21,2021-06-24,,,,
c5,Baseline,2021-09-22,Simdega,T.Tanger,Tukupani,Tukupani,Tripti dungdung,2020-09-30,Asyani dungdung, ,2020-10-10,,2020-10-10,2020-11-26,2020-11-26,2020-11-26,,2020-11-26,2020-12-27,2021-01-11,2020-12-26,2021-01-28,2021-02-26,2021-01-28,,2021-01-28,2021-07-22,,,,
c6,Baseline,2021-09-22,Simdega,T.Tanger,Paikpara,Paikpara,Manjeet pradhan,2018-07-16,Sakunta Pradhan, ,,,,2021-10-23,,,,,,,,,,,,,2021-10-23,,,,
c7,Baseline,2021-09-22,Simdega,T.Tanger,Konpala,Konpala,Arwin kerketta,2016-08-16,Sangeeta kerketta,9771021067,,,,,,,,,,,,,,,,,,,2021-10-28,,
c8,Baseline,2021-09-22,Simdega,T.Tanger,Konmenjar,Konmenja,Yan dungdung,2019-10-23,Minima dungdung,9560552011,2019-10-24,2019-10-23,2019-10-24,2019-12-12,2019-12-12,2019-12-12,,2019-12-12,2020-01-09,2020-01-09,2020-01-09,2020-03-12,2020-06-11,2020-06-11,,2020-02-10,2020-08-13,,2021-03-11,2021-03-11,2021-03-11
c9,Baseline,2021-09-22,Simdega,T.Tanger,Konmenjar,Konmenjar,Arthar Ayush dungdung,2020-06-30,Tarkeleng dungdung,9142406941,2020-06-30,2020-06-30,2020-06-30,2020-09-10,2020-09-10,2020-09-10,,2020-09-10,2020-10-08,2020-10-08,2020-10-08,2020-11-12,2020-11-12,2020-11-12,,2020-11-12,2021-05-13,,,,
c10,Baseline,2021-09-22,Simdega,T.Tanger,Konmenjar,Konmenjar,Rohan baraik,2018-12-26,Susanti devi,9958703269,2019-01-09,,2019-01-09,2019-02-27,2019-02-27,2019-02-27,2019-02-27,2019-02-27,2019-04-10,2019-04-10,2019-04-10,2019-06-12,2019-07-25,2019-07-25,,2019-07-25,2019-10-10,,,,
c11,Baseline,2021-09-22,Simdega,T.Tanger,Konbagi,Konmenjar,Suchita dungdung,2020-09-25,Alka shoni dungdung, ,,,2020-11-12,2020-11-12,2020-11-12,2020-11-12,,2020-11-12,2020-12-10,2020-12-10,2020-12-10,2021-02-11,2021-03-11,2021-03-11,,2021-03-11,2021-08-08,,,,
c12,Baseline,2021-09-22,Simdega,Kolebira,Raisiya,Bongram,Sonu dad,2021-06-04,Parva kumari,7257814186,2021-06-04,2021-06-04,2021-06-04,2021-09-18,2021-09-18,2021-09-18,2021-09-18,2021-09-18,2021-10-23,,2021-10-23,,,,,,,,,,
c13,Baseline,2021-09-22,Simdega,Kolebira,Raisiya,Bongram,Siwam das,2021-04-06,Siwani devi,8986854772,2021-04-06,,2021-04-06,2021-06-19,2021-06-19,2021-06-19,2021-06-19,2021-06-19,2021-07-20,2021-08-21,2021-08-21,2021-09-18,2021-09-18,2021-09-18,2021-09-18,2021-09-18,,,,,
c14,Baseline,2021-09-22,Simdega,Kolebira,Raisiya,Bongram,Jaykant mehar,2021-03-09,Nilam devi,9284678856,2021-03-09,2021-03-09,2021-03-09,2021-05-15,2021-05-15,2021-05-15,2021-10-23,2021-05-15,2021-06-19,2021-06-19,2021-06-19,2021-07-17,2021-07-17,2021-07-17,,2021-07-17,,,,,
c15,Baseline,2021-09-22,Simdega,Kolebira,Barasloya,Sijang,Adityi  kumari,2021-02-15,Punam kumari,9304637412 9508628105,2021-02-15,2021-02-15,2021-02-15,2021-05-17,2021-05-17,2021-05-17,2021-05-17,2021-05-17,2021-06-17,2021-08-05,2021-08-05,2021-09-02,2021-09-02,2021-09-02,2021-10-28,2021-09-02,,,,,
c16,Baseline,2021-09-22,Simdega,T.Tanger,Dumki,Dumki,Deepsun Dung Dung,2019-06-23,Sangeeta Dung Dung,8580243801,2019-07-04,,2019-07-04,2019-10-03,2019-10-03,2019-10-03,,2019-10-03,2019-11-07,2019-11-07,2019-11-07,2019-12-05,2019-12-05,2019-12-05,,2019-12-05,2020-06-04,2020-04-18,2020-12-03,2020-12-21,2020-12-03
c17,Baseline,2021-09-22,Simdega,T.Tanger,Dumki,Dumki,Ronal kiro,2019-07-25,Goreti kiro, ,2019-08-01,,2019-08-01,2019-10-03,2019-10-03,2019-10-03,,2019-10-03,2019-11-07,2019-11-07,2019-11-07,2019-12-05,2019-12-05,2019-12-05,,2019-12-05,2020-06-04,2020-06-04,2020-12-03,2020-12-21,2020-12-03
c18,Baseline,2021-09-22,Simdega,T.Tanger,Dumki,Dumki,Arpit kiro,2020-02-05,Partima kiro,8986706754,2020-02-06,2020-02-05,2020-02-06,2020-05-28,2020-05-28,2020-05-28,,2020-05-28,2020-06-25,2020-06-25,2020-06-25,2020-08-27,2020-08-27,2020-08-27,,2020-08-27,2020-11-26,2020-11-26,2021-08-26,2021-08-26,2021-08-26
c19,Baseline,2021-09-22,Simdega,T.Tanger,Thethaitangar,Thethaitangar,Misti kumari,2020-11-15,Asha devi, ,2020-11-16,2020-11-15,2020-11-16,2021-01-15,2021-01-15,2021-01-15,2021-01-01,2021-01-15,2021-02-25,2021-02-25,2021-02-25,2021-03-25,2021-03-26,2021-03-25,2021-03-25,2021-03-25,2021-08-26,2021-08-26,,,
c20,Baseline,2021-09-22,Simdega,T.Tanger,Thethaitangar,Thethaitangar,Ayush Kumar,2017-11-03,Aasha devi, ,,,,2021-10-28,,,,,,,,,,,,,2021-10-28,,,,
c21,Baseline,2021-09-22,Simdega,T.Tanger,Thethaitangar,Thethaitangar,Riya Kumari,2017-07-12,9693707520, ,,,,2021-10-28,,,,,,,,,,,,,2021-10-28,,,,
c22,Baseline,2021-09-22,Simdega,T.Tanger,Koromiya,Koromiya,Nityanand Das,2020-07-02,Megha Devi,9334517857 7004152981,2020-07-11,,2020-07-11,2020-09-03,2020-09-03,2020-09-03,,2020-09-03,2020-10-08,2020-10-08,2020-10-08,2020-11-12,2020-11-12,2020-12-04,,2020-11-12,2021-04-04,,,,
c23,Baseline,2021-09-22,Simdega,T.Tanger,Koromiya,Koromiya,Abhay Singh,2020-10-19,Munika Devi,7667762839,,,2020-12-10,2020-12-10,2020-12-10,2020-12-10,,2020-12-10,2021-01-10,2021-01-14,2021-01-14,2021-02-11,2021-02-11,2021-02-11,,2021-02-11,2021-10-23,,,,
c24,Baseline,2021-09-22,Simdega,T.Tanger,Koromiya,Koromiya,Surya Singh,2019-01-28,Munita Devi,7676741424,2019-01-28,2019-01-28,,2019-03-14,2019-03-14,,,2019-03-14,2019-04-14,2019-05-09,2019-05-09,2019-06-13,2019-06-09,2019-06-13,,2019-05-23,2019-11-14,,2020-06-11,2021-10-23,2020-06-11
c25,Baseline,2021-09-22,Simdega,T.Tanger,Koromiya,Koromiya,Aditi Dungdung,2020-08-12,Mery Monika Dungdung, ,,,2020-09-10,2020-10-10,2020-10-08,2020-10-09,,,2020-11-10,2020-11-12,2020-11-05,2020-12-10,2020-12-10,2020-12-10,,,,,,,
c26,Baseline,2021-09-22,Simdega,T.Tanger,Koromiya,Koromiya,Gautam Singh,2020-09-18,Sanjho Devi,8252856768,2020-10-01,,2020-10-01,2020-11-12,2020-10-31,2020-11-12,,2021-01-14,2020-12-12,2020-12-10,2020-12-10,2021-01-14,2021-01-14,2021-01-14,,,2021-08-12,,,,
c27,Baseline,2021-09-22,Simdega,T.Tanger,T. Tangar,Rajabasa,Amit baghwar,2017-12-17,Binita baghwar,6201518423 6201518423,,,,2021-10-28,,,,,,,,,,,,,2021-10-28,,,,
c28,Baseline,2021-09-22,Simdega,T.Tanger,T. Tangar,Rajabasa,Premika bhengra,2021-09-08,Lalita bhengra,9162722995 9162722995,,2021-09-08,2021-10-28,,,2021-10-28,,,,,,,,,,,,,,,
c29,Baseline,2021-09-22,Simdega,T.Tanger,Joram,Ambapan,Aayansh soreng,2020-02-27,Neelima kullu, ,2020-02-27,2020-02-27,2020-02-27,2020-07-04,2020-04-10,2020-07-04,2020-08-10,2020-09-04,2020-08-04,2020-08-13,2020-08-13,2020-09-10,2020-09-10,2020-09-10,2020-10-09,2020-11-03,2021-02-13,2021-03-28,2021-09-11,2021-09-11,2021-08-11
c30,Baseline,2021-09-23,Simdega,Kolebira,Banderchuwan,HSC banderchuwan,Aprila jojo,2020-04-16,Sundermani jojo, ,2020-04-16,2020-04-16,2020-04-16,2020-06-25,2020-06-25,2020-06-25,2020-06-25,2020-06-25,2020-07-23,2020-09-23,2020-09-23,2020-08-27,2020-11-08,2020-10-23,,2020-08-27,2021-01-28,,2021-09-23,2021-09-23,2021-09-23
c31,Baseline,2021-10-04,Simdega,Kolebira,Barasloya,Sijang ,Aradhya kumari ,2021-02-02,Malini Devi,7061552483,2021-02-11,2021-02-02,2021-02-11,2021-04-17,2021-04-17,2021-04-17,2021-11-04,2021-04-17,2021-05-17,2021-05-17,2021-05-17,2021-06-19,2021-06-19,2021-06-19,,2021-06-19,2021-11-04,,,,
c32,Baseline,2021-09-24,Simdega,T.Tanger,Konpala,Konpala,Rupa kumari,2019-03-28,Laxami Devi,9661841052,,,2019-04-25,2019-05-10,2019-05-23,2019-05-23,,,2019-06-27,2019-06-27,2019-06-27,2019-07-25,2019-07-25,2019-07-25,,,2020-01-23,,2021-10-28,2020-10-22,2020-10-22
c33,Baseline,2021-09-24,Simdega,T.Tanger,Konpala,Konpala,Radhika kumari,2020-09-07,Geeta devi, ,2020-09-15,,2020-09-15,2020-12-22,2020-12-22,2020-12-22,,2020-10-22,2021-01-22,2021-01-22,2021-01-22,2021-04-10,2021-04-10,2021-04-10,,2021-04-10,2021-06-12,,,,
c34,Baseline,2021-09-24,Simdega,T.Tanger,Konpala,Konpala,Lavli Kumari,2017-09-08,Jashoda devi, ,,,,2021-10-28,,,,,,,,,,,,,2021-10-28,,,,
c35,Baseline,2021-09-24,Simdega,T.Tanger,Konpala,Konpala,Ritika Kumari,2019-03-07,Sangita devi, ,,,2019-08-28,2019-04-19,2019-04-25,2019-04-25,,2019-04-25,2019-05-23,2019-05-23,2019-05-23,2019-06-27,2019-06-27,2019-09-27,,2019-06-27,2019-12-23,,,2020-09-24,2020-09-24
c36,Baseline,2021-09-24,Simdega,T.Tanger,Konpala,Konpala,Ramlal Mahto,2020-09-01,Kashila devi, ,,,2020-09-24,2020-10-14,2020-10-22,2020-10-22,,2020-10-22,2020-11-26,2020-11-26,2020-11-26,,,,,,2021-05-28,,,,
c37,Baseline,2021-09-24,Simdega,T.Tanger,Konpala,Konpala,Aryan kerketta,2019-03-08,Jyoti kerketta,7764937939,,,2019-03-28,2019-04-20,2019-04-25,2019-04-25,,2019-04-25,2019-05-23,2019-05-23,2019-05-23,2019-06-27,2019-06-27,2019-06-27,,2019-06-27,2020-02-03,,2020-11-26,2021-10-28,2021-10-28
c38,Baseline,2021-09-24,Simdega,T.Tanger,Tukupani,Tukupani,Sonika Kumari,2020-02-02,Jhariyo devi,7766945825,,,2020-09-05,2020-09-05,2020-03-27,2020-03-24,,,2020-10-06,2020-05-12,2020-04-23,2020-12-08,2020-06-27,2021-01-07,,2021-01-07,2021-04-06,,,,
c39,Baseline,2021-09-24,Simdega,T.Tanger,Tukupani,Tukupani,Reshma Kumari,2021-05-19,Sawetri devi, ,,,2021-06-17,2021-08-07,2021-08-07,2021-08-07,2021-08-07,2021-08-07,2021-09-04,2021-09-04,2021-09-04,,,,,,,,,,
c40,Baseline,2021-09-24,Simdega,T.Tanger,Konmenjar,Konmenjar,Mekha kumari,2021-07-22,Priya kumari,8102595440,2021-08-01,,2021-08-14,2021-09-23,2021-09-23,2021-09-23,2021-09-23,2021-09-23,,,,,,,,,,,,,
c41,Baseline,2021-09-24,Simdega,T.Tanger,Konmenjar,Konmenjar,Rupesh baraik,2021-05-09,Kiran devi, ,2021-05-13,,2021-05-13,2021-06-24,2021-06-24,2021-06-24,2021-06-24,2021-06-24,2021-07-25,2021-09-23,2021-09-23,2021-10-28,2021-10-28,,,,,,,,
c42,Baseline,2021-09-24,Simdega,T.Tanger,Konmenjar,Konmenjar,Soniya kumari,2021-08-16,Santi  devi,7498813365,2021-08-16,2021-08-16,2021-10-28,2021-10-28,,2021-10-28,,,,,,,,,,,,,,,
c43,Baseline,2021-09-24,Simdega,T.Tanger,Konmenjar,Konmenjar,Lucky  Singh,2021-06-07,Geeta devi,8252519914,,,2021-08-12,2021-07-22,2021-07-22,2021-07-22,,2021-07-22,2021-08-22,2021-09-23,2021-09-23,2021-10-28,2021-10-28,,,,,,,,
c44,Baseline,2021-09-24,Simdega,T.Tanger,Konmenjar,Konmenjar,Aarav jaiswal,2021-08-06,Shivani kumari,8252555373,2021-08-07,2021-08-06,2021-08-07,2021-09-23,2021-09-23,2021-09-23,2021-09-23,2021-09-23,,,,,,,,,,,,,
c45,Baseline,2021-09-24,Simdega,T.Tanger,Konmenjar,Konmenjar,Sanjan kumari,2021-06-26,Sunita devi,6206948370,,,2021-08-12,2021-09-23,2021-09-23,2021-09-23,2021-09-23,2021-09-23,2021-10-28,,,,,,,,,,,,
c46,Baseline,2021-09-24,Simdega,T.Tanger,Tukupani,Tukupani,Ayush  badaik,2019-09-14,Kunti devi, ,2019-09-21,,2019-09-21,2019-11-09,2019-11-09,2019-11-09,,2019-11-09,2019-12-09,2019-12-09,2019-12-09,2020-01-08,2020-06-04,2020-01-04,,2020-01-04,2020-07-04,,2021-02-06,2021-02-06,2021-02-06
c47,Baseline,2021-09-24,Simdega,Kolebira,Barasloya,Sijang,Piriya Kumari,2021-05-08,Sabita Kumari,7488405627 7488405627,2021-05-20,,2021-05-20,2021-08-05,2021-08-05,2021-08-05,2021-08-05,2021-08-05,2021-09-11,2021-09-11,2021-09-11,2021-10-28,2021-10-28,,,,,,,,
c48,Baseline,2021-09-24,Simdega,Kolebira,Barasloya,Sijang,Bhupesh Ram,2018-10-27,Sahodra devi,7319743936 7319743936,2018-10-27,,2018-10-27,2018-12-09,2018-12-09,2018-12-17,2018-12-22,2018-12-11,2019-01-07,2019-01-09,2019-01-16,2019-02-14,2019-02-14,2019-02-14,2019-02-14,2019-02-14,2019-08-03,2019-08-23,2020-02-24,2020-02-29,2020-02-06
c49,Baseline,2021-09-22,Simdega,T.Tanger,Bambalkera,Bambalkera,Menesa lugun,2020-03-18,Rilen lugun,8252062073,,,2020-05-14,2020-05-14,2020-05-14,2020-05-14,,2020-05-14,2020-06-11,2020-06-11,2020-06-11,2020-07-09,2020-07-09,2020-07-09,2020-07-09,2020-07-09,2021-01-14,,2021-08-12,2021-08-12,2021-08-12
c50,Baseline,2021-09-22,Simdega,T.Tanger,Bambalkera,Bambalkera,Anugrahit lugun,2016-12-12,Rilen lugun,8252062073,,,,2021-10-23,,,,,,,,,,,,,2021-10-23,,,,
c51,Baseline,2021-09-24,Simdega,T.Tanger,Meromdega,Pandripani,Aditya turi,2020-11-11,Monika dev,9905388415,2020-11-21,2020-11-11,2020-11-26,2020-12-24,2020-12-24,2021-01-01,,2020-12-21,2021-01-28,2021-01-28,2021-01-28,2021-02-25,2021-02-25,2021-02-25,,,,,,,
c52,Baseline,2021-09-24,Simdega,T.Tanger,Meromdega,Pandripani,Davinsas soreng,2021-03-15,Nirmala Soreng,8002480522,2021-03-15,2021-03-15,2021-03-15,2021-08-26,2021-07-22,2021-07-22,,2021-07-22,2021-10-30,2021-08-26,2021-08-26,,2021-10-30,,,,,,,,
c53,Baseline,2021-09-24,Simdega,T.Tanger,Koromiya,Koromiya,Prince Lohra,2020-01-31,Gudiya Devi,6206494771,2020-01-31,2020-01-31,2020-01-31,2020-06-14,2020-05-14,2020-05-14,,2020-05-14,2020-07-14,2020-06-11,2020-06-11,2020-08-14,2020-07-09,2020-07-09,,2020-07-09,2020-12-10,,2021-08-12,2021-08-12,2021-08-12
c54,Baseline,2021-09-24,Simdega,T.Tanger,Koromiya,Koromiya,Atul Patar,2020-11-16,Brijni Devi,9162336871,,,2020-11-17,2021-01-14,2021-01-14,2021-01-14,,2021-01-14,2021-02-11,2021-02-11,2021-02-11,2021-03-11,2021-03-11,2021-03-11,,2021-03-11,,,,,
c55,Baseline,2021-09-24,Simdega,T.Tanger,Koromiya,Koromiya,Jayaraj Singh,2020-07-03,Surajni Devi,8847520918,2020-07-13,2020-07-03,2020-08-03,,,,,2020-09-18,,,,,,,,2020-11-17,,,,,
c56,Baseline,2021-09-24,Simdega,T.Tanger,Koromiya,Koromiya,Shivani Kumari,2019-04-11,Fulvanti Devi,6202034531,,,2019-05-09,2019-06-13,2019-06-13,2019-06-13,,2019-09-13,2019-07-11,2019-07-11,2019-07-11,2019-09-12,2019-09-12,2019-09-12,,,2020-02-13,,2020-09-10,2021-10-30,2021-10-30
c57,Baseline,2021-09-24,Simdega,T.Tanger,Koromiya,Koromiya,Rohit Nayak,2019-01-01,Reshmi Devi,9518367106,,,2019-01-18,2019-03-14,2019-03-14,2019-03-14,,2019-03-14,2019-04-11,2019-04-11,2019-04-11,2019-06-15,2019-06-13,2019-06-13,,2019-06-13,2019-11-14,2019-10-28,2020-06-11,2021-10-30,2021-10-30
c58,Baseline,2021-09-24,Simdega,T.Tanger,Koromiya,Koromiya,Prashant Nayak,2019-02-20,Shanti Devi,6206502805,,,2019-03-01,2019-04-11,2019-04-11,2019-04-11,,2019-04-11,2019-05-09,2019-05-09,2019-05-09,2019-06-13,2019-06-13,2019-06-13,,2019-06-13,2019-12-14,,2020-07-09,2020-08-09,2020-08-09
c59,Baseline,2021-09-24,Simdega,T.Tanger,Koromiya,Koromiya,Dinesh Singh,2017-07-24,Sanjho Devi,7541969867,,,,2021-10-30,,,,,,,,,,,,,2021-10-30,,,,
c60,Baseline,2021-09-22,Simdega,T.Tanger,Koromiya,Koromiya,Rupa Kumari,2017-05-08,Khahuli Rabha,6200428038,,,,2021-10-23,,,,,,,,,,,,,2021-10-23,,,,
c61,Baseline,2021-09-22,Simdega,T.Tanger,Koromiya,Koromiya,Rani Kumari,2017-05-08,Khahuli Rabha,6200428038,,,,2021-10-23,,,,,,,,,,,,,2021-10-23,,,,
c62,Baseline,2021-09-24,Simdega,T.Tanger,Rajabasa,Rajabasa,Kaifol samad,2019-11-20,Beuty samad, ,,,2019-12-05,2020-01-09,2020-01-09,2020-01-09,,2020-01-09,2020-02-09,2020-03-12,2020-03-12,2021-10-28,,,,,2021-10-28,,,,
c63,Baseline,2021-09-24,Simdega,T.Tanger,Rajabasa,Rajabasa,Priskila samad,2019-07-01,Roylen samad,9381072485,,,2019-11-07,2019-11-12,2019-11-12,2019-11-12,,2019-11-12,2019-12-13,2020-03-12,2020-03-12,2020-02-14,2020-04-27,2020-05-14,,2020-01-11,2020-07-09,,,,
c64,Baseline,2021-09-24,Simdega,T.Tanger,Rajabasa,"Rajabasa
",Anisha lugun,2020-03-07,Sanarti lugun,9015202078,2020-03-17,2020-03-07,2020-03-07,2021-09-24,2020-04-19,2020-04-27,2020-05-02,2020-04-21,,2020-05-20,2020-05-27,,2020-07-05,2020-07-14,2020-07-10,2020-06-30,2021-09-24,2021-01-01,,,
c65,Baseline,2021-09-24,Simdega,T.Tanger,Rajabasa,Rajabasa,Amayra samad,2021-08-27,Bahalen samad, ,,,,,,,,,,,,,,,,,,,,,
c66,Baseline,2021-09-24,Simdega,T.Tanger,"Rajabasa
",Rajabasa,Ishika samad,2019-06-04,Bahalen samad,9897501164,2019-06-06,,2019-06-06,2019-08-08,2019-08-08,2019-08-08,,2019-08-08,2019-09-12,2019-09-12,2019-09-12,2019-10-10,2019-10-10,2019-10-10,,2019-10-10,2020-03-12,,2021-01-14,2021-01-14,2021-01-14
c67,Baseline,2021-09-24,Simdega,T.Tanger,Kereya,Kereya,Niksant barla,2020-02-20,Agetha barla,9523383051 9523383051,2020-03-02,,2020-03-02,2020-05-28,2020-05-28,2020-05-28,,2020-05-28,2020-06-25,2020-06-25,2020-06-25,2020-08-27,2020-09-25,2020-09-25,,2020-09-25,2020-12-21,,,,
c68,Baseline,2021-09-24,Simdega,T.Tanger,Kereya,Kereya,Sneka soreng,2018-12-05,Urmila soreng,9523830013,2018-12-05,2018-12-05,2018-12-05,2019-01-24,2019-01-24,2019-01-24,,2019-01-24,2019-02-28,2019-02-28,2019-02-28,2019-03-28,2019-03-28,2019-03-28,,2019-03-28,2019-10-24,,2020-05-28,2020-05-28,2020-05-28
c69,Baseline,2021-09-24,Simdega,Kolebira,Lachragarh,HSC Lachragarh,Aryan Singh,2021-07-30,Sujata Kumari Singh,9693429236,2021-08-09,,2021-08-28,2021-09-16,2021-09-16,2021-09-16,,,,,,,,,,,,,,,
c70,Baseline,2021-09-24,Simdega,Kolebira,Lachragarh,HSC Lachragarh,Hardik singh,2020-11-11,Parmila Kumari,9131734079,2020-11-21,,2020-11-28,2021-01-21,2021-01-21,2021-01-21,,2021-01-21,2021-02-25,2021-02-25,2021-02-25,2021-03-25,2021-03-25,2021-03-25,,2021-03-25,2021-08-19,,,,
c71,Baseline,2021-09-24,Simdega,Kolebira,Lachragarh,HSC Lachragarh,Shreya Singh,2018-06-03,Bhagwati devi,6202573559 8798137560,,,,2021-10-28,,,,,,,,,,,,,2021-10-28,,,,
c72,Baseline,2021-09-24,Simdega,Kolebira,Lachragarh,HSC Lachragarh,Harshit Singh,2017-12-12,Let Punam devi,9065481274,,,,,,,,,,,,,,,,,,,,,
c73,Baseline,2021-09-24,Simdega,Kolebira,Lachragarh,HSC Lachragarh,Shruti Kumari,2017-12-14,Sushila Devi,8294707136,,,,2021-10-28,,,,,,,,,,,,,2021-10-28,,,,
c74,Baseline,2021-09-24,Simdega,T.Tanger,Dumki,Dumki,Alex soreng,2020-02-01,Sushma soreng,8789273077,2020-02-01,,2020-02-01,2020-03-15,2020-03-15,2020-03-23,,2020-03-17,2020-04-13,2020-04-15,2020-04-22,2020-06-04,2020-06-04,2020-06-04,,2020-06-04,2021-03-04,2020-11-27,2021-05-31,2021-10-28,2021-10-28
c75,Baseline,2021-09-24,Simdega,T.Tanger,Dumki,Dumki,Nitis kerketta,2020-08-31,Alka kerketta,7061572424,2020-08-31,,2020-08-31,2020-10-13,2020-10-13,2020-10-21,,2020-10-15,2020-11-11,2020-11-13,2020-11-20,2020-12-11,2020-12-29,2021-01-07,,2020-12-24,2021-09-02,2021-09-02,,,
c76,Baseline,2021-09-24,Simdega,T.Tanger,Dumki.,Dumki,Aimsan minz,2021-07-19,Katrina minz,9560402162,2021-07-29,,2021-09-02,2021-10-28,2021-10-28,,,,,,,,,,,,,,,,
c77,Baseline,2021-09-24,Simdega,T.Tanger,Dumki,Dumki,Akansha Dung Dung,2020-03-22,Usha dung dunge,9199863364,2020-03-22,,2020-03-22,2020-05-04,2020-05-04,2020-05-12,,2020-05-06,2020-06-04,2020-06-04,2020-06-11,2020-07-02,2020-07-02,2020-07-11,,2020-07-02,2020-12-27,,2021-09-02,2021-09-02,2021-09-02
c78,Baseline,2021-09-24,Simdega,T.Tanger,Dumki,Dumki,Olina kiro,2020-06-11,Ranuka kiro,6202593772,2020-06-11,,2020-06-11,2020-07-24,2020-07-24,2020-08-01,,2020-07-26,2020-09-03,2020-09-03,2020-09-03,2020-10-01,2020-10-01,2020-10-01,,2020-10-01,2021-07-01,2021-04-07,,2021-10-28,2021-10-28
c79,Baseline,2021-09-24,Simdega,T.Tanger,"Thethaitangar
",Thethaitangar,Blessi Dungdung,2021-05-15,Vinodi Dungdung, ,2021-05-15,2021-05-15,2021-05-28,2021-07-13,2021-07-13,2021-07-13,2021-07-13,2021-07-13,2021-08-28,2021-08-28,2021-08-28,2021-09-23,2021-09-23,2021-09-23,2021-09-23,2021-09-23,,,,,
c80,Baseline,2021-09-24,Simdega,T.Tanger,Thethaitangar,Thethaitangar,Aaysha soreng,2021-02-08,Rose Dungdung, ,2021-02-18,2021-02-08,2021-02-10,2021-03-23,2021-04-10,2021-04-10,2021-04-10,2021-04-10,2021-04-23,2021-05-12,2021-05-12,2021-07-10,2021-07-10,2021-07-10,,2021-07-10,,,,,
c81,Baseline,2021-09-24,Simdega,T.Tanger,Thethaitangar,Thethaitangar,Sallu Kumari,2021-05-24,Neha Devi, ,2021-05-24,2021-05-24,2021-06-15,2021-07-20,2021-07-20,2021-07-20,2021-07-20,2021-07-20,2021-08-20,2021-09-23,2021-09-23,2021-09-23,2021-10-28,,2021-09-23,2021-09-23,,,,,
c82,Baseline,2021-09-25,Simdega,T.Tanger,Konmenjar,Konmenjar,Akasher kumari,2018-06-26,Rinky Kumari,7903237594,,,,2021-10-28,,,,,,,,,,,,,2021-10-28,,,,
c83,Baseline,2021-09-25,Simdega,T.Tanger,Konmenjar,Konmenjar,Prince kerketta,2021-08-18,Anugrahit soreng,9284855746,,,2021-10-28,2021-10-28,2021-10-28,,,,,,,,,,,,,,,,
c84,Baseline,2021-09-25,Simdega,T.Tanger,Konmenjar,Konmenjar,Sakshi  baa,2018-08-08,Gorti kumari, ,,,,2021-10-28,,,,,,,,,,,,,2021-10-28,,,,
c85,Baseline,2021-09-25,Simdega,T.Tanger,Konmenjar,Konmenjar,Sunita kerketta,2018-07-05,Binita kerketta, ,,,,2021-10-28,,,,,,,,,,,,,2021-10-28,,,,
c87,Baseline,2021-09-25,Simdega,T.Tanger,Rajabasa,Semarkudar,Dipika kumari,2019-07-03,Vimla godin, ,2019-07-03,,2019-07-03,2019-08-21,2019-08-21,,,,2019-09-18,2019-09-18,,2019-11-20,2019-11-20,,,,2020-05-14,,,2020-11-30,2020-11-12
c88,Baseline,2021-09-25,Simdega,T.Tanger,Rajabasa,Semarkudar,Amit gond,2019-04-28,Sulochna devi,8986641856,,,2019-04-28,2019-06-13,2019-06-13,2019-06-13,,2019-06-13,2019-07-11,2019-07-11,2019-07-11,2019-09-12,2019-09-12,2019-09-12,,2019-09-12,2020-02-02,,2020-08-17,2020-08-20,2020-08-17
c89,Baseline,2021-09-25,Simdega,T.Tanger,Rajabasa,Semarkudar,Sumit gond,2018-12-13,Lalmait devi, ,2018-12-13,,2018-12-13,2019-02-14,2019-02-14,2019-02-14,,2019-02-14,2019-03-14,2019-03-14,2019-03-14,2019-04-11,2019-04-11,2019-04-11,,2019-04-11,2019-09-12,,,,
c90,Baseline,2021-09-25,Simdega,T.Tanger,Rajabasa,Rajabas,Anisha lugun,2020-03-09,Sanarti lugun, ,2020-03-09,2020-03-09,2020-03-09,2020-05-21,2020-05-21,2020-05-21,2020-05-21,2020-05-21,2020-06-18,2020-06-18,2020-06-18,2020-07-16,2020-07-16,2020-08-16,2020-07-16,2020-08-16,2020-12-17,2020-12-17,,,
c91,Baseline,2021-09-27,Simdega,T.Tanger,Konpala,Konpala,Puja kumari,2019-12-01,jashoda Devi, ,2019-12-11,,2019-12-23,2020-02-27,2020-02-27,2020-02-27,,2020-02-27,2020-03-29,2020-05-28,2020-05-28,2020-05-31,2020-06-25,2020-06-25,,2020-06-25,2020-09-24,,,,
c92,Baseline,2021-09-27,Simdega,T.Tanger,Konpala,Konpala,Sanjit kerketta,2016-09-20,Jyoti kerketta,7764937939 7764937939,,,,,,,,,,,,,,,,,,,2021-10-28,,
c93,Baseline,2021-09-27,Simdega,T.Tanger,Konpala,Konpala,Mukesh Hajam,2017-04-30,Punam devi,9661494991 9661494991,,,,2021-10-28,,,,,,,,,,,,,2021-10-28,,,,
c95,Baseline,2021-09-27,Simdega,T.Tanger,Konpala,Konpala,Harsita kerketta,2018-06-14,Punam pratima kerketta,7366087264 7366087264,,,,2021-10-28,,,,,,,,,,,,,2021-10-28,,,,
c96,Baseline,2021-09-27,Simdega,T.Tanger,Konpala,Konpala,Jageshwar gwala,2016-03-04,Sumanti devi, ,,,,,,,,,,,,,,,,,,,2021-10-28,,
c97,Baseline,2021-09-27,Simdega,T.Tanger,Konpala,Konpala,Riya kerketta,2018-04-04,Rosita kerketta, ,,,,2021-10-28,,,,,,,,,,,,,2021-10-28,,,,
c98,Baseline,2021-09-27,Simdega,T.Tanger,Konpala,Konpala,Arman dung dung,2019-12-16,Anima dung dung, ,2019-12-23,,2019-12-23,2020-02-27,2020-02-27,2020-02-27,,2020-02-27,2020-03-29,2020-05-28,2020-05-28,2021-10-28,,,,,2021-09-24,,2021-09-23,2021-10-28,2021-09-23
c99,Baseline,2021-09-27,Simdega,T.Tanger,Taraboga,Taraboga,Anosent Barwa,2020-10-29,Salomi Barwa, ,2020-10-29,,2020-10-29,2020-12-17,2020-12-17,2020-12-17,,2020-12-17,2021-01-21,2021-01-21,2021-01-21,2021-02-20,2021-02-18,2021-02-18,,2021-02-18,2021-09-16,,,,
c100,Baseline,2021-09-27,Simdega,T.Tanger,Taraboga,Taraboga,Anandeep Ekka,2019-05-11,Swati Ekka,8987532104,2019-05-13,,2019-05-13,2019-07-04,2019-07-04,2019-07-04,,2019-07-04,2019-08-16,2019-08-16,2019-08-16,2019-10-18,2019-12-19,2019-12-19,,2019-12-19,2020-02-20,2020-02-20,2020-09-17,2020-09-17,2020-09-17
c101,Baseline,2021-09-27,Simdega,T.Tanger,Taraboga,Taraboga,Asim lakra,2020-12-27,Rupan Lakra,9341442382,2020-12-27,,2020-12-27,2021-02-18,2021-02-18,2021-02-18,2021-10-28,2021-02-18,2021-03-18,2021-03-18,2021-03-18,2021-04-15,2021-04-15,2021-04-15,,2021-04-15,2021-09-27,2021-09-27,,,
c102,Baseline,2021-09-27,Simdega,T.Tanger,Taraboga,Taraboga,Susant Dung Dung,2021-03-16,Sukanti Dung Dung,6370605072,2021-03-26,,2021-04-15,2021-06-17,2021-06-17,2021-06-17,2021-06-17,2021-06-17,2021-07-15,2021-07-15,2021-07-15,2021-08-19,2021-08-19,2021-08-19,2021-08-19,2021-08-19,,,,,